skip to content »

ik-kem.ru

Updating message authorization code

9958 verbose enoent SKIPPING OPTIONAL DEPENDENCY: 9959 warn optional SKIPPING OPTIONAL DEPENDENCY: [email protected] (node_modules\ionic\node_modules\formidable): 9960 warn enoent SKIPPING OPTIONAL DEPENDENCY: ENOENT: no such file or directory, utime 'C:\Users\KARNAV\App Data\Roaming\npm\node_modules\.staging\formidable-469de146\Readme.md' 9961 verbose enoent SKIPPING OPTIONAL DEPENDENCY: This is related to npm not being able to find a file.

updating message authorization code-1updating message authorization code-37updating message authorization code-83

9943 verbose enoent SKIPPING OPTIONAL DEPENDENCY: 9944 warn optional SKIPPING OPTIONAL DEPENDENCY: [email protected] (node_modules\ionic\node_modules\cli-width): 9945 warn enoent SKIPPING OPTIONAL DEPENDENCY: ENOENT: no such file or directory, utime 'C:\Users\KARNAV\App Data\Roaming\npm\node_modules\.staging\cli-width-bf65c7ef\.travis.yml' 9946 verbose enoent SKIPPING OPTIONAL DEPENDENCY: This is related to npm not being able to find a file.9964 verbose enoent SKIPPING OPTIONAL DEPENDENCY: 9965 warn optional SKIPPING OPTIONAL DEPENDENCY: [email protected] (node_modules\ionic\node_modules\ipaddr.js): 9966 warn enoent SKIPPING OPTIONAL DEPENDENCY: ENOENT: no such file or directory, utime 'C:\Users\KARNAV\App Data\Roaming\npm\node_modules\.staging\ipaddr.js-a0d05983\README.md' 9967 verbose enoent SKIPPING OPTIONAL DEPENDENCY: This is related to npm not being able to find a file.9967 verbose enoent SKIPPING OPTIONAL DEPENDENCY: 9968 warn optional SKIPPING OPTIONAL DEPENDENCY: [email protected] (node_modules\ionic\node_modules\async): 9969 warn enoent SKIPPING OPTIONAL DEPENDENCY: ENOENT: no such file or directory, utime 'C:\Users\KARNAV\App Data\Roaming\npm\node_modules\.staging\async-a74fdc97\dist\async.js' 9970 verbose enoent SKIPPING OPTIONAL DEPENDENCY: This is related to npm not being able to find a file.Found issue: npm/npm#16861 delete node_modules and npm install had no effect npm cache verify said was valid npm cache clean --force, delete node_modules, npm install had no effect delete App Data/Roaming/npm and npm-cache and current package-lock.json, then npm i -g npm, then npm install worked npm cache clean --force resolved my issue!!I too had same problem but got fixed by this but before using this I uninstalled grunt locally and globally and deleted and nodemodule from working project...:) happens to me too, no package-lock.json,like this npm ERR! sha1-j67Sx BAIchzx Edod MNm Vu Fvk K 0= integrity checksum failed when using sha1: wanted sha1-j67Sx BAIchzx Edod MNm Vu Fvk K 0= but got sha1-oxm Pd Hl Og67Goe Lu9FY/ 95s Qc4=.9970 verbose enoent SKIPPING OPTIONAL DEPENDENCY: 9971 warn optional SKIPPING OPTIONAL DEPENDENCY: [email protected] (node_modules\ionic\node_modules\diff): 9972 warn enoent SKIPPING OPTIONAL DEPENDENCY: ENOENT: no such file or directory, utime 'C:\Users\KARNAV\App Data\Roaming\npm\node_modules\.staging\diff-3aed4245\dist\diff.js' 9973 verbose enoent SKIPPING OPTIONAL DEPENDENCY: This is related to npm not being able to find a file.

9973 verbose enoent SKIPPING OPTIONAL DEPENDENCY: 9974 verbose type Operational Error 9975 verbose stack Error: sha512-q4spe4KTfs AS1SUHLO0wz8Qiyf1 v MIAgp RYio FYDMNq Kf HQbg AVDH3i4fvpl71/P1L0d Bl f Qi P37UYf0ew== integrity checksum failed when using sha512: wanted sha512-q4spe4KTfs AS1SUHLO0wz8Qiyf1 v MIAgp RYio FYDMNq Kf HQbg AVDH3i4fvpl71/P1L0d Bl f Qi P37UYf0ew== but got sha512-u85RN e P4n Aar Chfbezr Wf TEYv V5q6RWak Shn/p Sb8ezfets A l OSYo Djh Jv PNtm Dj CHjz0GE635y JIk9Avb Qw==.

(2237 bytes) here is my ) I have arch linux, and i can intall packages from AUR, example i could not install jscs or gulp with npm and use corresponding packages in with npm it FAILED!

(Surprisingly, i could install express for example) I do these steps to fix the problem: npm i -g npm npm ERR! sha512-ZJs OWVJ25E2C5Qedf4w9e PIv5hr PCd DIs Hhq89t Rx SJCqy If DAMh0Ko U9xe Tu7y HT9Zrx PF7mopq1TCWxt Mfkw== integrity checksum failed when using sha512: wanted sha512-ZJs OWVJ25E2C5Qedf4w9e PIv5hr PCd DIs Hhq89t Rx SJCqy If DAMh0Ko U9xe Tu7y HT9Zrx PF7mopq1TCWxt Mfkw== but got sha512-B6ny ZFj9it JJv FCBJimets KCSd Xnvx Ub Yrw6WF0C97Gjutws W4Ogh X z GAN2gv Fe JU2a7Tm AEp7/u AQSQ61Lr Q==. A complete log of this run can be found in: npm ERR!

9929 verbose enoent SKIPPING OPTIONAL DEPENDENCY: 9930 warn optional SKIPPING OPTIONAL DEPENDENCY: [email protected] (node_modules\ionic\node_modules\dargs): 9931 warn enoent SKIPPING OPTIONAL DEPENDENCY: ENOENT: no such file or directory, utime 'C:\Users\KARNAV\App Data\Roaming\npm\node_modules\.staging\dargs-4227eb6a\readme.md' 9932 verbose enoent SKIPPING OPTIONAL DEPENDENCY: This is related to npm not being able to find a file.

9932 verbose enoent SKIPPING OPTIONAL DEPENDENCY: 9933 warn optional SKIPPING OPTIONAL DEPENDENCY: [email protected] (node_modules\ionic\node_modules\continuable-cache): 9934 warn enoent SKIPPING OPTIONAL DEPENDENCY: ENOENT: no such file or directory, utime 'C:\Users\KARNAV\App Data\Roaming\npm\node_modules\.staging\continuable-cache-f1714960\.jshintrc' 9935 verbose enoent SKIPPING OPTIONAL DEPENDENCY: This is related to npm not being able to find a file.

@ionic/cli-plugin-cordova : 1.6.2 @ionic/cli-plugin-ionic-angular : 1.4.1 @ionic/cli-utils : 1.7.0 ionic (Ionic CLI) : 3.7.0 global packages: Cordova CLI : 7.0.1 local packages: @ionic/app-scripts : 2.1.3 Cordova Platforms : none Ionic Framework : ionic-angular 3.2.1 System: Node : v6.11.2 OS : OS X El Capitan npm : 4.6.1 Ok, guys. 9923 verbose enoent SKIPPING OPTIONAL DEPENDENCY: 9924 warn optional SKIPPING OPTIONAL DEPENDENCY: [email protected] (node_modules\ionic\node_modules\cookiejar): 9925 warn enoent SKIPPING OPTIONAL DEPENDENCY: ENOENT: no such file or directory, utime 'C:\Users\KARNAV\App Data\Roaming\npm\node_modules\.staging\cookiejar-fd2dc595\cookiejar.js' 9926 verbose enoent SKIPPING OPTIONAL DEPENDENCY: This is related to npm not being able to find a file.